New-style system based on JSON feed and MongoDB

Connected to "ucl_0" mongo instance.

Undergraduate Courses
  • changed in the last day: 0
  • changed in the last 7 days: 0
  • changed in the last month: 16
Post-graduate Courses
  • changed in the last day: 2
  • changed in the last 7 days: 12
  • changed in the last month: 32
Search for any PG or UG Course
Most recent errors
March 23, 2017, 3:17 a.m.FAIL - PRINT UBAESPSDUA05 failed (Document has too many pages; File "/home/rptlab/website/ucl.reportlab.com/ucl_0/local/lib/python2.7/site-packages/reportlab/platypus/flowables.py", line 1955, in wrap: raise AssertionError(value))
March 23, 2017, 3:17 a.m.PDF generation of WEB brochure for course UBAESPSDUA05 failed with message `Undergraduate Course `european-social-political-studies-dual-degree-ba.pdf` brochure returned more than 4 pages`
March 22, 2017, 3:17 a.m.FAIL - PRINT UBAESPSDUA05 failed (Document has too many pages; File "/home/rptlab/website/ucl.reportlab.com/ucl_0/local/lib/python2.7/site-packages/reportlab/platypus/flowables.py", line 1955, in wrap: raise AssertionError(value))
March 22, 2017, 3:17 a.m.PDF generation of WEB brochure for course UBAESPSDUA05 failed with message `Undergraduate Course `european-social-political-studies-dual-degree-ba.pdf` brochure returned more than 4 pages`
March 21, 2017, 3:17 a.m.FAIL - PRINT UBAESPSDUA05 failed (Document has too many pages; File "/home/rptlab/website/ucl.reportlab.com/ucl_0/local/lib/python2.7/site-packages/reportlab/platypus/flowables.py", line 1955, in wrap: raise AssertionError(value))
March 21, 2017, 3:17 a.m.PDF generation of WEB brochure for course UBAESPSDUA05 failed with message `Undergraduate Course `european-social-political-studies-dual-degree-ba.pdf` brochure returned more than 4 pages`
March 20, 2017, 1:17 p.m.ERROR - UBAPHISING09 - not valid json in http://www.ucl.ac.uk/prosp-students/hub/?cat=ug&name=pdfs&year=2017&route=UBAPHISING09&output=json
March 20, 2017, 1:16 p.m.ERROR - TMAEDUSLLD01 - not valid json in http://wwwapps-live.ucl.ac.uk/prosp-students/hub/?cat=pgt&name=pdfsjson&year=2017&route=TMAEDUSLLD01&output=json
March 20, 2017, 1:15 p.m.ERROR - TMSMEDSEDU01 - not valid json in http://wwwapps-live.ucl.ac.uk/prosp-students/hub/?cat=pgt&name=pdfsjson&year=2017&route=TMSMEDSEDU01&output=json
March 20, 2017, 3:17 a.m.FAIL - PRINT UBAESPSDUA05 failed (Document has too many pages; File "/home/rptlab/website/ucl.reportlab.com/ucl_0/local/lib/python2.7/site-packages/reportlab/platypus/flowables.py", line 1955, in wrap: raise AssertionError(value))